Year,Jurisdiction,Jur_Name,Parcel_ID,Account,Location_Code,Jur1,Jur2,Jur 3,Jur 4,Jur 5,Jur 6,Jur 7,Jur 8,Jur 9,Jur 10,Jur 11,Jur 12,Is_Exempt,Prop_Street_Number,Prop_Street,Prop_Street_Dir,Prop_City,Prop_State,Prop_Zip5,Prop_Zip4,Owner_Id,Owner_Prefix,Name,Careof,Street,Street_Overflow,City,State,Zip5,Zip4,Interest,Ceiling_Year,Ceiling_Tax,Homestead_Code,Agent_Code,Acres,Legal1,Legal2,Legal3,Mortgage_Code,Land_Hs,Land_Nhs,Land_Productivity_Market,Land_1d1,Land_1d,Land_Timber,Personal_Hs,Personal_Nhs,Market_Value,Net_Taxable_Value,State_Homestead,State_Mandated_Over65,State_Mandated_Disabled,Optional65,Local_Disabled,Road_Homestead,Disabled_Veteran,New_Personal_Hs,New_Personal_Nhs,Improvement_Hs,New_Improvement_Hs,Improvement_Nhs,New_Improvement_Nhs,Is_Owner_Confidential,Local_Discount,Map1,Map2,Ownership_Sequence,Is_Protested,Has_Hs_Link,Primary_Category_Code,Secondary_Category_Code,Third_Category_Code,DBA,Has_Abatement,Has_Miscellaneous_Exemption,Name1,Legal4
2020,01,CAD,2,1-10-300010010010000000,10,01,02,03,10,12,22,32,,,,,,False,,NAIDA,,,TX,,,3068990,R,"WINRIGHT ANADARKO I RESOURCES, L.P.",,4747 RESEARCH FOREST DR,SUITE 180-275,THE WOODLANDS,TX,77381,,1.000000,0,0.00,,R2200,1.5900,TRACT 1 BLK 1 152,OFFICE & INDUST PARK,,,0,15900,0,0,0,0,0,0,15900,15900,0,0,0,0,0,0,0,0,0,0,0,0,0,False,0,,,1,False,False,C1R,,,,False,False,K E ANDREWS & COMPANY,
2020,01,CAD,3,1-10-300010010010010000,10,01,02,03,10,12,22,32,,,,,,False,1917,ALCOCK,,,TX,,,3068990,R,"WINRIGHT ANADARKO I RESOURCES, L.P.",,4747 RESEARCH FOREST DR,SUITE 180-275,THE WOODLANDS,TX,77381,,1.000000,0,0.00,,R2200,2.3300,TR 1A BLK 1 152,OFFICE & IND PARK,,,0,23300,0,0,0,0,0,0,182720,182720,0,0,0,0,0,0,0,0,0,0,0,159420,0,False,0,4-050,,1,False,False,F2,,,,False,False,K E ANDREWS & COMPANY,
2020,01,CAD,4,1-10-300010020010000000,10,01,02,03,10,12,22,32,,,,,,False,1801,ALCOCK,,,,,,391550,R,HARDEN GALE,,BOX 2696,,PAMPA,TX,79066,,1.000000,0,0.00,,,0.5100,PART OF LOT 1 BLK 2,152 OFFICE & IND PRK,,,0,5100,0,0,0,0,0,0,57490,57490,0,0,0,0,0,0,0,0,0,0,0,52390,0,False,0,3-050,,1,False,False,F1,,,,False,False,,
2020,01,CAD,5,1-10-300010020020000000,10,01,02,03,10,12,22,32,,,,,,False,,NAIDA,N,,TX,,,905950,R,STUART JILL LEWIS,,PO BOX 1112,,PAMPA,TX,79065,,1.000000,0,0.00,,,1.0800,PART OF LOT 1 ALL OF,2 & N51 OF LOT 3,152 OFFICE & IND PK,,0,10800,0,0,0,0,0,0,121690,121690,0,0,0,0,0,0,0,0,0,0,0,110890,0,False,0,,,1,False,False,F1,,,,False,False,,
2020,01,CAD,6,1-10-300010020030000000,10,01,02,03,10,12,22,32,,,,,,False,,NAIDA,N,,TX,,,547600,R,LEWIS JILL SUSAN,,BOX 1112,,PAMPA,TX,79066,,1.000000,0,0.00,,,0.8800,S49 OF 3 ALL OF 4,& N27 OF 5 BLK 2,152 OFFICE AND,,0,8800,0,0,0,0,0,0,166900,166900,0,0,0,0,0,0,0,0,0,0,0,158100,0,False,0,,,1,False,False,F1,,,,False,False,,INDUSTRIAL PARK
2020,01,CAD,7,1-10-300010020040000000,10,01,02,03,10,12,22,32,,,,,,False,1807,ALCOCK,,,,,,547500,R,LEWIS JILL S,,PO BOX 1112,,PAMPA,TX,79066,1112,1.000000,0,0.00,,,1.4400,PART OF LOT 1 BLK 2,152 OFFICE & IND PK,,,0,14400,0,0,0,0,0,0,133320,133320,0,0,0,0,0,0,0,0,0,0,0,118920,0,False,0,,,1,False,False,F1,,,,False,False,,
2020,01,CAD,8,1-10-300010020050000000,10,01,02,03,10,12,22,32,,,,,,False,118,NAIDA,,,TX,,,547600,R,LEWIS JILL SUSAN,,BOX 1112,,PAMPA,TX,79066,,1.000000,0,0.00,,,1.0000,S73 OF 5 BLK 2 152,OFFICE & INDUST. PK,,,0,4000,0,0,0,0,0,0,62330,62330,0,0,0,0,0,0,0,0,0,0,0,58330,0,False,0,3-050,,1,False,False,F1,,,,False,False,,
2020,01,CAD,9,1-10-300010020060000000,10,01,02,03,10,12,22,32,,,,,,False,114,NAIDA,,,,,,905950,R,STUART JILL LEWIS,,PO BOX 1112,,PAMPA,TX,79065,,1.000000,0,0.00,,,1.0000,LOT 6 BLK 2 152,OFFICE & INDUST PARK,,,0,4000,0,0,0,0,0,0,212400,212400,0,0,0,0,0,0,0,0,0,0,0,208400,0,False,0,3-050,,1,False,False,F1,,,,False,False,,
2020,01,CAD,10,1-10-300010020070000000,10,01,02,03,10,12,22,32,,,,,,False,100,NAIDA,,,TX,,,905950,R,STUART JILL LEWIS,,PO BOX 1112,,PAMPA,TX,79065,,1.000000,0,0.00,,,1.0000,LOT 7 BLK 2 152,OFFICE & INDUST PARK,,,0,4000,0,0,0,0,0,0,85220,85220,0,0,0,0,0,0,0,0,0,0,0,81220,0,False,0,3-050,,1,False,False,F1,,,,False,False,,
2020,01,CAD,11,1-10-300010030010000000,10,01,02,03,10,12,22,32,,,,,,False,,NAIDA,,,TX,,,905950,R,STUART JILL LEWIS,,PO BOX 1112,,PAMPA,TX,79065,,1.000000,0,0.00,,,1.0000,E170 OF N40 OF 1,BLK 3,152 OFFICE & IND PRK,,0,400,0,0,0,0,0,0,400,400,0,0,0,0,0,0,0,0,0,0,0,0,0,False,0,,,1,False,False,C1R,,,,False,False,,
2020,01,CAD,12,1-10-300010030011000000,10,01,02,03,10,12,22,32,,,,,,False,,,,,TX,,,916850,R,T L RENTAL PROPERTIES,LIMITED PARTNERSHIP,101 S. NAIDA,,PAMPA,TX,79065,,1.000000,0,0.00,,,6.0000,LOT 1 EXCEPT E170,OF N40 & ALL 2-6,152 OFFICE & IND PRK,,0,5000,0,0,0,0,0,0,5000,5000,0,0,0,0,0,0,0,0,0,0,0,0,0,False,0,,,1,False,False,C1C,,,,False,False,,
2020,01,CAD,18,1-10-300010030070000000,10,01,02,03,10,12,22,32,,,,,,False,,NAIDA,,,TX,,,100520,R,ENCISO RAUL & ANA,,1811 CHESTNUT DR,,PAMPA,TX,79065,,1.000000,0,0.00,,,2.0220,LOTS 12-15 BLK 3,152 OFFICE & IND PRK,,,0,1820,0,0,0,0,0,0,1820,1820,0,0,0,0,0,0,0,0,0,0,0,0,0,False,0,,,1,False,False,C1R,,,,False,False,,
2020,01,CAD,27,1-10-300010040010000000,10,01,02,03,10,12,22,32,,,,,,False,13051,HWY 60,,,TX,,,658350,R,MURPHY-BROWN LLC,,PO BOX 856,,WARSAW,NC,28398,0856,1.000000,0,0.00,,R2885,3.2200,LOT 1 BLK 4   152,OFFICE&INDUSTRIAL PK,3.22 ACRES,,0,1610,0,0,0,0,0,0,271290,271290,0,0,0,0,0,0,0,0,0,0,0,269680,0,False,0,,,1,False,False,F2,,,,False,False,RYAN INC,
2020,01,CAD,28,1-10-300010040020000000,10,01,02,03,10,12,22,32,,,,,,False,,,,,TX,,,331650,R,GARCIA FRANCISCO & MERCED,,PO RET 12/2015,,,,,,1.000000,0,0.00,,,4.1800,LOT 2 BLK 4 152,OFFICE INDUSTRIAL PK,4.18 ACRES,,0,2090,0,0,0,0,0,0,2090,2090,0,0,0,0,0,0,0,0,0,0,0,0,0,False,0,,,1,False,False,C1R,,,,False,False,,
2020,01,CAD,29,1-10-300010040021000000,10,01,02,03,10,12,22,32,,,,,,False,,,,,TX,,,592200,R,MAYBERRY WENDELL,,1308 E FOSTER AVE,,PAMPA,TX,79065,,1.000000,0,0.00,,,1.9400,LOT 2 BLK 4 152,OFFICE INDUSTRIAL PL,1.94 ACRES,,0,970,0,0,0,0,0,0,970,970,0,0,0,0,0,0,0,0,0,0,0,0,0,False,0,,,1,False,False,C1R,,,,False,False,,
2020,01,CAD,30,1-10-300010040021100000,10,01,02,03,10,12,22,32,,,,,,False,,,,,TX,,,331000,R,GARAY MARCO,,P O BOX 454,,CACTUS,TX,79013,,1.000000,0,0.00,,,1.0000,LOT 2 BLK 4 152,OFFICE INDUSTRIAL PL,1.00 ACRE,,0,500,0,0,0,0,0,0,500,500,0,0,0,0,0,0,0,0,0,0,0,0,0,False,0,,,1,False,False,C1R,,,,False,False,,
2020,01,CAD,31,1-10-300010050010000000,10,01,02,03,10,12,22,32,,,,,,False,1901,CARTER,,,TX,,,703350,R,PANTECHS LABORATORIES INC,,PO BOX 64489,,LUBBOCK,TX,79464,4489,1.000000,0,0.00,,,1.0000,LOT 1 BLK 5 OFFICE,& INDUSTRIAL PARK,,,0,4000,0,0,0,0,0,0,130360,130360,0,0,0,0,0,0,0,0,0,0,0,126360,0,False,0,3-050,,1,False,False,F2,,,,False,False,,
2020,01,CAD,32,1-10-300010050020000000,10,01,02,03,10,12,22,32,,,,,,False,111,NAIDA,,,TX,,,419950,R,HESS CHILDRENS LTD PTR,,BOX 721,,PAMPA,TX,79066,,1.000000,0,0.00,,R4416,2.0000,LOTS 2&3 BLK 5 152,OFFICE & INDUST. PK,,,4000,0,0,0,0,0,0,0,328980,328980,0,0,0,0,0,0,0,0,0,324980,0,0,0,False,0,3-050,,1,False,False,F2,,,,False,False,MERITAX LLC,
2020,01,CAD,33,1-10-300010050040000000,10,01,02,03,10,12,22,32,,,,,,False,101,NAIDA,,,TX,,,35700,R,ATACORP INC,,PO BOX 1916,,PAMPA,TX,79066,,1.000000,0,0.00,,,1.0000,LOT 4 BLK 5 152,OFFICE & INDUST PARK,,,0,1100,0,0,0,0,0,0,248860,248860,0,0,0,0,0,0,0,0,0,0,0,247760,0,False,0,3-050,,1,False,False,F2,,,,False,False,,
2020,01,CAD,34,1-10-300010050050000000,10,01,02,03,10,12,22,32,,,,,,False,,NAIDA,,,TX,,,111500,R,BROWN FRED METHANOL INC,,307 W 7TH  STE 1110,,FORT WORTH,TX,76102,,1.000000,0,0.00,,R2225,7.0000,LOTS 5-11 BLK 5,152 OFFICE &,INDUST PARK,,7700,0,0,0,0,0,0,0,7700,7700,0,0,0,0,0,0,0,0,0,0,0,0,0,False,0,,,1,False,False,C1R,,,,False,False,KIRKWOOD & DARBY INC,
2020,01,CAD,35,1-10-300010050060000000,10,01,02,03,10,12,22,32,,,,,,False,,,,,TX,,,111500,R,BROWN FRED METHANOL INC,,307 W 7TH  STE 1110,,FORT WORTH,TX,76102,,1.000000,0,0.00,,,1.0000,LOT 6 BLK 5,152 OFFICE & INDUST,PARK,,0,1100,0,0,0,0,0,0,1100,1100,0,0,0,0,0,0,0,0,0,0,0,0,0,False,0,,,1,False,False,C1R,,,,False,False,,
2020,01,CAD,41,1-10-300010050120000000,10,01,02,03,10,12,22,32,,,,,,True,248,NAIDA,,,TX,,,701600,R,PAMPA SOCCER ASSOC,,PO BOX 997,,PAMPA,TX,79066,,1.000000,0,0.00,,,1.0000,LOTS 12-19 BLK 5 152,OFFICE & INDUST PARK,,,0,8800,0,0,0,0,0,0,38120,0,0,0,0,0,0,0,0,0,0,0,0,29320,0,False,0,,,1,False,False,XVF,,,,False,False,,
2020,01,CAD,49,1-10-300050010010000000,10,01,02,03,10,12,22,32,,,,,,False,863,LOCUST,E,,TX,,,3070446,R,THOMASON WHITSON LILLIAN VINA,,304 ANNE ST.,,PAMPA,TX,79065,,1.000000,0,0.00,,,0.1447,LOT 1 BLK 1,ALLAM ADDITION,,,0,900,0,0,0,0,0,0,900,900,0,0,0,0,0,0,0,0,0,0,0,0,0,False,0,,,1,False,False,C1,,,,False,False,,
2020,01,CAD,50,1-10-300050010020000000,10,01,02,03,10,12,22,32,,,,,,False,857,LOCUST,E,,TX,,,736750,R,PORTILLO MARIO ESTATE,,920 VARNON,,PAMPA,TX,79065,,1.000000,0,0.00,,,0.1378,LOT 2 BLK 1,ALLAM ADDITION,,,860,0,0,0,0,0,0,0,11680,11680,0,0,0,0,0,0,0,0,0,10820,0,0,0,False,0,1 030,,1,False,False,A1,,,,False,False,,
2020,01,CAD,51,1-10-300050010030000000,10,01,02,03,10,12,22,32,,,,,,False,853,LOCUST,E,,TX,,,102518,R,JUAREZ H MA DEL ROSARIO,,677 N OSAGE,,AMARILLO,TX,79107,,1.000000,0,0.00,,,0.1378,LOT 3 BLK 1,ALLAM ADDITION,,,0,860,0,0,0,0,0,0,8430,8430,0,0,0,0,0,0,0,0,0,7570,0,0,0,False,0,1 030,,1,False,False,A1,,,,False,False,,
2020,01,CAD,52,1-10-300050010040000000,10,01,02,03,10,12,22,32,,,,,,False,851,LOCUST,E,,TX,,,596175,R,MC CLELLAND RANDY & VICKI,,828 LOCUST,,PAMPA,TX,79065,,1.000000,0,0.00,,,0.1378,LOT 4 BLK 1,ALLAM ADDITION,,,860,0,0,0,0,0,0,0,10690,10690,0,0,0,0,0,0,0,0,0,9830,0,0,0,False,0,1 030,,1,False,False,A1,,,,False,False,,
2020,01,CAD,53,1-10-300050010050000000,10,01,02,03,10,12,22,32,,,,,,False,847,LOCUST,E,,TX,,,336100,R,GARZA EDUARDO,,834 E CRAVEN,,PAMPA,TX,79065,,1.000000,0,0.00,,,0.1378,LOT 5 BLK 1,ALLAM ADDITION,,,0,860,0,0,0,0,0,0,860,860,0,0,0,0,0,0,0,0,0,0,0,0,0,False,0,1 030,,1,False,False,C1,,,NO MOBILE HOME,False,False,,
2020,01,CAD,54,1-10-300050010070000000,10,01,02,03,10,12,22,32,,,,,,False,819,LOCUST,E,,TX,,,578700,R,MARIN JOSE L,,832 E CRAVEN,,PAMPA,TX,79065,,1.000000,0,0.00,,,0.2756,LOTS 6&7 BLK 1,ALLAM ADDITION,,,0,1720,0,0,0,0,0,0,1720,1720,0,0,0,0,0,0,0,0,0,0,0,0,0,False,0,1 030,,1,False,False,C1,,,,False,False,,
2020,01,CAD,55,1-10-300050010080000000,10,01,02,03,10,12,22,32,,,,,,False,817,LOCUST,E,,TX,,,578700,R,MARIN JOSE L,,832 E CRAVEN,,PAMPA,TX,79065,,1.000000,0,0.00,,,0.1090,E34 OF 8 BLK 1,ALLAM ADDITION,,,0,680,0,0,0,0,0,0,680,680,0,0,0,0,0,0,0,0,0,0,0,0,0,False,0,1 030,,1,False,False,C1,,,,False,False,,
2020,01,CAD,56,1-10-300050010090000000,10,01,02,03,10,12,22,32,,,,,,False,815,LOCUST,E,,TX,,,947625,R,TORRES E & J MARTINEZ,,815 LOCUST,,PAMPA,TX,79065,,1.000000,0,0.00,,,0.1666,W9 OF 8 & ALL OF 9,BLK 1 ALLAM,,,0,1040,0,0,0,0,0,0,1040,1040,0,0,0,0,0,0,0,0,0,0,0,0,0,False,0,1 030,,1,False,False,C1,,,,False,False,,
2020,01,CAD,57,1-10-300050020010000000,10,01,02,03,10,12,22,32,,,,,,False,862,LOCUST,E,,TX,,,3051368,R,BATMAN MELVIN,,PO RET 11/19,,,,,,1.000000,0,0.00,,,0.1570,LOT 1 BLK 2,ALLAM ADDITION,TXFLV8633015,,910,0,0,0,0,0,0,0,9560,9560,0,0,0,0,0,0,0,0,0,8650,0,0,0,False,0,,,1,False,False,A2,,,28X48 MOBILE HOME TXFLV8633015,False,False,,
2020,01,CAD,58,1-10-300050020020000000,10,01,02,03,10,12,22,32,,,,,,False,856,LOCUST,E,,TX,,,578900,R,MARISCAL GRACIELA,,856 LOCUST,,PAMPA,TX,79065,,1.000000,0,0.00,,,0.2961,LOT 2&3 BLK 2,ALLAM ADDITION,,,0,1720,0,0,0,0,0,0,16700,16700,0,0,0,0,0,0,0,0,0,14980,0,0,0,False,0,1 030,,1,False,False,A1,,,,False,False,,
2020,01,CAD,60,1-10-300050020040000000,10,01,02,03,10,12,22,32,,,,,,False,852,LOCUST,E,,TX,,,345150,R,GILES STEVE & JANET,,1119 E HARVESTER AVE,,PAMPA,TX,79065,,1.000000,0,0.00,,,0.1481,LOT 4 BLK 2,ALLAM ADDITION,,,860,0,0,0,0,0,0,0,10980,10980,0,0,0,0,0,0,0,0,0,10120,0,0,0,False,0,1 030,,1,False,False,A1,,,,False,False,,
2020,01,CAD,61,1-10-300050020050000000,10,01,02,03,10,12,22,32,,,,,,False,842,LOCUST,E,,TX,,,3071484,R,ACOSTA JOSE M,TANGUMA JUAN & IRENE,842 S LOCUST,,PAMPA,TX,79065,,1.000000,0,0.00,,,0.2961,LOTS 5&6 BLK 2,ALLAM,,,1720,0,0,0,0,0,0,0,10260,10260,0,0,0,0,0,0,0,0,0,8540,0,0,0,False,0,1 030,,1,False,False,A1,,,,False,False,,
2020,01,CAD,62,1-10-300050020070000000,10,01,02,03,10,12,22,32,,,,,,False,828,LOCUST,E,,TX,,,596100,R,MC CLELLAND GEORGE,,828 E LOCUST,,PAMPA,TX,79065,,1.000000,0,0.00,H,,0.4442,LOTS 7-9 BLK 2,ALLAM ADDITION,,,2580,0,0,0,0,0,0,0,37830,37830,0,0,0,0,0,0,0,0,0,35250,0,0,0,False,0,1 030,,1,False,False,A2,,,32X68 FREEDOM,False,False,,
2020,01,CAD,64,1-10-300050020100000000,10,01,02,03,10,12,22,32,,,,,,False,829,FREDERIC,E,,TX,,,100831,R,PATEL NIMIT I,,821 E FREDERIC,,PAMPA,TX,79065,,1.000000,0,0.00,,,0.1180,N 120 OF LOT 10,BLK 2 ALLAM,829-831 E FREDERIC,,3870,0,0,0,0,0,0,0,3870,3870,0,0,0,0,0,0,0,0,0,0,0,0,0,False,0,,,1,False,False,C1,,,,False,False,,
2020,01,CAD,65,1-10-300050020110000000,10,01,02,03,10,12,22,32,,,,,,False,833,FREDERIC,E,,TX,,,100831,R,PATEL NIMIT I,,821 E FREDERIC,,PAMPA,TX,79065,,1.000000,0,0.00,,,0.2370,N 120 OF LOT 11&12,BLK 2 ALLAM,,,7740,0,0,0,0,0,0,0,7740,7740,0,0,0,0,0,0,0,0,0,0,0,0,0,False,0,,,1,False,False,C1,,,NO MOBILE HOME,False,False,,
2020,01,CAD,66,1-10-300050020130000000,10,01,02,03,10,12,22,32,,,,,,False,845,FREDERIC,E,,TX,,,1012550,R,WHITSON JOHN C ESTATE,,304 ANNE,,PAMPA,TX,79065,,1.000000,0,0.00,,,0.2370,N 120 OF LOTS,13 & 14,ALLAM ADDITION,,7740,0,0,0,0,0,0,0,20890,20890,0,0,0,0,0,0,0,0,0,13150,0,0,0,False,0,1 030,,1,False,False,A1,,,,False,False,,
2020,01,CAD,67,1-10-300050020150000000,10,01,02,03,10,12,22,32,,,,,,False,859,FREDERIC,E,,,,,331750,R,GARCIA JESUS & MARIA,,1041 HUFF RD,,PAMPA,TX,79065,,1.000000,0,0.00,,,0.4800,N120 OF 15-18,BLK 2 ALLAM,,,10450,0,0,0,0,0,0,0,52550,52550,0,0,0,0,0,0,0,0,0,0,0,42100,0,False,0,1-030,,1,False,False,F1,,,,False,False,,
2020,01,CAD,68,1-10-300100010010000000,10,01,02,03,10,12,22,32,,,,,,False,1501,RUSSELL,N,,TX,,,200900,R,COX JOHN L & BARBARA,,1501 N RUSSELL,,PAMPA,TX,79065,,1.000000,0,0.00,H,,0.4555,E144.8 OF 1&2 BLK 1,G H ALEXANDER S/D,,,7750,0,0,0,0,0,0,0,91210,91210,0,0,0,0,0,0,0,0,0,83460,0,0,0,False,0,,,1,False,False,A1,,,,False,False,,
2020,01,CAD,69,1-10-300100016030000000,10,01,02,03,10,12,22,32,,,,,,False,1506,WILLISTON,,,TX,,,485400,R,JOHNSON SCOTT,,1506 WILLISTON,,PAMPA,TX,79065,,1.000000,0,0.00,H,,0.1447,N 60 OF LOTS 3 & 4 BLK 1,G H ALEXANDER,SUBDIVISION,,4200,0,0,0,0,0,0,0,69600,69600,0,0,0,0,0,0,0,0,0,65400,0,0,0,False,0,4 020,,1,False,False,A1,,,,False,False,,
2020,01,CAD,70,1-10-300100018030000000,10,01,02,03,10,12,22,32,,,,,,False,1500,WILLISTON,,,TX,,,543550,R,LEIGH JEFFREY G,,1500 WILLISTON,,PAMPA,TX,79065,,1.000000,0,0.00,H,,0.1825,S 75.7 OF 3 & 4 BLK 1,G H ALEXANDER,SUBDIVISION,,5300,0,0,0,0,0,0,0,127840,112960,0,0,0,0,0,0,0,0,0,122540,0,0,0,False,0,4 020,,1,False,False,A1,,,,False,False,,
2020,01,CAD,71,1-10-300130030922070000,10,01,02,03,10,12,22,32,,,,,,False,,,,,TX,,,698900,R,PAMPA COUNTRY CLUB,,BOX 1438,,PAMPA,TX,79066,1438,1.000000,0,0.00,,,1.4700,SEC 92 BLK 3 I&GN,TRACT Q 1.47 ACS,,,0,4120,0,0,0,0,0,0,4120,4120,0,0,0,0,0,0,0,0,0,0,0,0,0,False,0,,,1,False,False,C1R,,,,False,False,,
2020,01,CAD,73,1-10-300130030924060000,10,01,02,03,10,12,22,32,,,,,,False,1776,HARVESTER,E,,TX,,,979450,R,WADE WILLIAM E & CAROL,,1776 E HARVESTER,,PAMPA,TX,79065,,1.000000,0,0.00,H,,0.8100,SEC 92 BLK 3 I&GN,.81 AC ABST 405,,,5670,0,0,0,0,0,0,0,228300,228300,0,0,0,0,0,0,0,0,0,222630,0,0,0,False,0,,,1,False,False,A1,,,,False,False,,
2020,01,CAD,74,1-10-300130030924070000,10,01,02,03,10,12,22,32,,,,,,False,1700,HARVESTER,,,TX,,,769350,R,REEVES DARIAN & CHRISTINA,,1700 E HARVESTER,,PAMPA,TX,79065,,1.000000,0,0.00,H,,1.1700,SEC 92 BLK 3 I&GN,TRACT N 1.17 ACRES,NE/4,,8190,0,0,0,0,0,0,0,250530,250530,0,0,0,0,0,0,0,0,0,242340,0,0,0,False,0,,,1,False,False,A1,,,,False,False,,
2020,01,CAD,75,1-10-300130030924100000,10,01,02,03,10,12,22,32,,,,,,False,1601,BROWNING,E,,TX,,,372000,R,GRIMSLEY JUDITH ANN ESTATE,,RET P O 2012,,,,,,1.000000,0,0.00,,,1.0000,SEC 92 BLK 3 I&GN,TRACT 0 1 ACRE,,,0,2800,0,0,0,0,0,0,2800,2800,0,0,0,0,0,0,0,0,0,0,0,0,0,False,0,,,1,False,False,C1,,,,False,False,,
2020,01,CAD,76,1-10-300130030924150000,10,01,02,03,10,12,22,32,,,,,,False,1701,BROWNING,E,,TX,,,513050,R,KIRBY TERESA ELAINE,,1701 E BROWNING,,PAMPA,TX,79065,,1.000000,0,0.00,H,,1.5800,SEC 92 BLK 3 I&GN,TRACT P 1.58 ACRES,,,11060,0,0,0,0,0,0,0,78470,78470,0,0,0,0,0,0,0,0,0,67410,0,0,0,False,0,,,1,False,False,A1,,,,False,False,,
2020,01,CAD,77,1-10-300130030924250000,10,01,02,03,10,12,22,32,,,,,,False,,,,,TX,,,345200,R,GILES STEVEN,,1119 E HARVESTER,,PAMPA,TX,79065,4501,1.000000,0,0.00,,,3.4090,SEC 92 BLK 3 I&GN,3.409 ACS SE/4 OF,TRACT S,,0,9550,0,0,0,0,0,0,9850,9850,0,0,0,0,0,0,0,0,0,0,0,300,0,False,0,,,1,False,False,C1,,,,False,False,,
2020,01,CAD,78,1-10-300130030924251000,10,01,02,03,10,12,22,32,,,,,,False,1812,HARVESTER,E,,TX,,,3071228,R,ARNEY CLINTON,,1812 E HARVESTER,,PAMPA,TX,79065,,1.000000,0,0.00,H,,2.5510,SEC 92 BLK 3 I&GN,2.551 ACS N/W CORNER OF,TRACT S,,17860,0,0,0,0,0,0,0,223980,223980,0,0,0,0,0,0,0,0,0,206120,0,0,0,False,0,,,1,False,False,A1,,,,False,False,,
2020,01,CAD,79,1-10-300130031001000000,10,01,02,03,10,12,22,32,,,,,,False,530,BROWN,W,,TX,,,940800,R,THURMAN FAMILY LIVING TR,,PO BOX 924,,PAMPA,TX,79066,,1.000000,0,0.00,,,0.9800,SEC 103 BLK 3 I&GN,.988 ACRES,,,4570,0,0,0,0,0,0,0,39830,39830,0,0,0,0,0,0,0,0,0,0,0,35260,0,False,0,,,1,False,False,F1,,,,False,False,,
2020,01,CAD,80,1-10-300130031030000000,10,01,02,03,10,12,22,32,,,,,,False,,,,,TX,,,568490,R,M&S LAND & CATTLE CO LLC,,2142 ASPEN DR,,PAMPA,TX,79065,,1.000000,0,0.00,,,4.2000,SEC 103 BLK 3 I&GN,4.204 AC,,,0,19570,0,0,0,0,0,0,19570,19570,0,0,0,0,0,0,0,0,0,0,0,0,0,False,0,,,1,False,False,C1C,,,,False,False,,
2020,01,CAD,81,1-10-300130031031000000,10,01,02,03,10,12,22,32,,,,,,False,,,,,TX,,,164250,R,CHISUM FAMILY PARTNER LTD,,PO BOX 1512,,PAMPA,TX,79066,,1.000000,0,0.00,,,7.5400,SEC 103 BLK 3 I&GN,7.54 ACS,,,0,17570,0,0,0,0,0,0,17570,17570,0,0,0,0,0,0,0,0,0,0,0,0,0,False,0,,,1,False,False,C1R,,,,False,False,,
2020,01,CAD,83,1-10-300130031032000000,10,01,02,03,10,12,22,32,,,,,,False,220,TYNG,W,,,,,3069240,R,INGRAM CONCRETE LLC,,331 NORTH MAIN ST,,EULESS,TX,76039,,1.000000,0,0.00,,R2200,2.5300,SEC 103 BLK 3 I&GN,2.53 AC,,,11790,0,0,0,0,0,0,0,193370,193370,0,0,0,0,0,0,0,0,0,0,0,181580,0,False,0,,,1,False,False,F2,,,,False,False,K E ANDREWS & COMPANY,
2020,01,CAD,84,1-10-300130031034000000,10,01,02,03,10,12,22,32,,,,,,False,630,BROWN,W,,TX,,,930400,R,TEXAS PIPE & METAL CO INC,,P O BOX 1816,,PAMPA,TX,79066,,1.000000,0,0.00,,,6.7900,SEC 103 BLK 3  I&GN,6.790    ACS,,,0,31640,0,0,0,0,0,0,307390,307390,0,0,0,0,0,0,0,0,0,0,0,275750,0,False,0,,,1,False,False,F2,,,,False,False,,
2020,01,CAD,85,1-10-300130031161050000,10,01,02,03,10,12,22,32,,,,,,False,2101,23RD,W,,,,,100824,R,PAMPA SPOT STORAGE,STORAGE SPOT HOLDINGS #1 LLC,7106 82ND ST,,LUBBOCK,TX,79424,,1.000000,0,0.00,,,7.5000,SEC 116 BLK 3 I&GN,TRACT Z-A ZB & ZE,,,0,75000,0,0,0,0,0,0,875340,875340,0,0,0,0,0,0,0,0,0,0,0,800340,0,False,0,,,1,False,False,F1,,,,False,False,,
2020,01,CAD,88,1-10-300130031161150000,10,01,02,03,10,12,22,32,,,,,,False,2013,23RD,W,,TX,,,205600,R,CRAWFORD JOSH & LACEY,,12001 PEACH DR,,PAMPA,TX,79065,,1.000000,0,0.00,,,2.5000,SEC 116 BLK 3 I&GN,TRACT Z-C,,,17500,0,0,0,0,0,0,0,17500,17500,0,0,0,0,0,0,0,0,0,0,0,0,0,False,0,4 060,,1,False,False,C1,,,,False,False,,
2020,01,CAD,90,1-10-300130031161300000,10,01,02,03,10,12,22,32,,,,,,False,,23RD,W,PAMPA,TX,79065,,570200,R,MACKAYS ABOVE ALL STORAGE,,308 MESA CIRCLE,,PLAINVIEW,TX,79072,6508,1.000000,0,0.00,,,5.0000,SEC 116 BLK 3 I&GN,TRACT Z-F,,,0,32500,0,0,0,0,0,0,32500,32500,0,0,0,0,0,0,0,0,0,0,0,0,0,False,0,,,1,False,False,C1C,,,,False,False,,
2020,01,CAD,91,1-10-300130031161400000,10,01,02,03,10,12,22,32,,,,,,False,,,,,TX,,,3067916,R,JOHNSON JOE DALE,,P.O. BOX 2154,,PAMPA,TX,79066,,1.000000,0,0.00,,,91.7800,SEC 116 BLK 3 I&GN TR Z-1 THRU,Z-4-1 & PARTS OF BLKS 3-6,SUNSET UNIT #1,,0,0,108580,10320,0,0,0,0,111460,13200,0,0,0,0,0,0,0,0,0,0,0,2880,0,False,0,,,1,False,False,D1,D2,D2,,False,False,,
2020,01,CAD,94,1-10-300130031161550000,10,01,02,03,10,12,22,32,,,,,,False,1834,PRICE,,,TX,,,3067916,R,JOHNSON JOE DALE,,P.O. BOX 2154,,PAMPA,TX,79066,,1.000000,0,0.00,H,,1.0000,SEC 116 BLK 3 I&GN,TRACT Z-4-C,,,7000,0,0,0,0,0,0,0,93410,93410,0,0,0,0,0,0,0,0,0,86410,0,0,0,False,0,4 060,,1,False,False,A1,,,,False,False,,
2020,01,CAD,95,1-10-300130031161600000,10,01,02,03,10,12,22,32,,,,,,False,1810,PRICE,,,TX,,,578200,R,MARAK LYNN & SHERYL,,1810 N PRICE RD,,PAMPA,TX,79065,,1.000000,0,0.00,H,,0.6700,SEC 116 BLK 3 I&GN,TRACT Z-4-A,,,1680,0,0,0,0,0,0,0,50130,50130,0,0,0,0,0,0,0,0,0,48450,0,0,0,False,0,4 060,,1,False,False,A1,,,,False,False,,
2020,01,CAD,96,1-10-300130031161650000,10,01,02,03,10,12,22,32,,,,,,False,1800,DAVIS,,,TX,,,3069222,R,MEARS JOHANNA COKER,,PO BOX 2834,,PAMPA,TX,79066,2834,1.000000,0,0.00,H,,0.6100,SEC 116 BLK 3 I&GN,TRACT Z-4-B,,,4270,0,0,0,0,0,0,0,92480,56190,0,0,0,0,0,0,0,0,0,88210,0,0,0,False,0,4 060,,1,False,False,A1,,,,False,False,,
2020,01,CAD,97,1-10-300130031161700000,10,01,02,03,10,12,22,32,,,,,,False,1800,PRICE,N,,TX,,,146450,R,CARTER BILLY DUANE,,1800 N PRICE RD,,PAMPA,TX,79065,,1.000000,0,0.00,H,,0.6400,SEC 116 BLK 3 I&GN,TRACT Z-4,.647 ACRES,,4480,0,0,0,0,0,0,0,73420,73420,0,0,0,0,0,0,0,0,0,68940,0,0,0,False,0,4 060,,1,False,False,A1,,,,False,False,,
2020,01,CAD,99,1-10-300130031163050000,10,01,02,03,10,12,22,32,,,,,,False,,KENTUCKY,W,,TX,,,484800,R,JOHNSON RANDY DEAN,,285 COUNTY ROAD 304C,,SEMINOLE,TX,79360,,1.000000,0,0.00,,,0.8400,SEC 116 BLK 3 I&GN,TRACT Y-1,,,0,1530,0,0,0,0,0,0,1530,1530,0,0,0,0,0,0,0,0,0,0,0,0,0,False,0,,,1,False,False,C1,,,,False,False,,
2020,01,CAD,100,1-10-300130031163100000,10,01,02,03,10,12,22,32,,,,,,False,,KENTUCKY,W,,TX,,,102104,R,KIMANN PROPERTIES LLC,,2301 CHATEAU RUE,,PAMPA,TX,79065,,1.000000,0,0.00,,,2.1000,SEC 116 BLK 3 I&GN,N306.18 OF TR Y1A &,Y1C  2.1 ACRES,,0,8400,0,0,0,0,0,0,8400,8400,0,0,0,0,0,0,0,0,0,0,0,0,0,False,0,,,1,False,False,C1C,,,,False,False,,
2020,01,CAD,101,1-10-300130031163105500,10,01,02,03,10,12,22,32,,,,,,False,1300,PRICE,N,,TX,,,270650,R,EASTSIDE PACKAGE LLC,DBA WESTSIDE PACKAGE,PO  BOX  1191,,CANADIAN,TX,79014,,1.000000,0,0.00,,,2.1000,SEC 116 BLK 3 I&GN,S306.82 OF TR Y1A &,Y1C  2.1 ACRES,,0,8400,0,0,0,0,0,0,570950,570950,0,0,0,0,0,0,0,0,0,0,0,562550,0,False,0,,,1,False,False,F1,,,,False,False,,
2020,01,CAD,102,1-10-300130031163150000,10,01,02,03,10,12,22,32,,,,,,False,2212,KENTUCKY,W,,TX,,,3068769,R,ISBELL LAURA SUE,,1504 MOCKINGBIRD LN,,BRIDGEPORT,TX,76426,,1.000000,0,0.00,,,0.2400,SEC 116 BLK 3 I&GN,TRACT Y-1-B,,,1680,0,0,0,0,0,0,0,12450,12450,0,0,0,0,0,0,0,0,0,10770,0,0,0,False,0,4 060,,1,False,False,A1,,,,False,False,,
2020,01,CAD,103,1-10-300130031163170000,10,01,02,03,10,12,22,32,,,,,,False,,,,,TX,,,484950,R,JOHNSON RICKY CARL,,5829 N SIERRA,,ODESSA,TX,79764,,1.000000,0,0.00,,,0.8400,SEC 116 BLK 3 I&GN,TRACT Y-1-D,,,0,1530,0,0,0,0,0,0,1530,1530,0,0,0,0,0,0,0,0,0,0,0,0,0,False,0,,,1,False,False,C1,,,,False,False,,
2020,01,CAD,105,1-10-300130031163210000,10,01,02,03,10,12,22,32,,,,,,False,2214,KENTUCKY,W,,TX,,,3068769,R,ISBELL LAURA SUE,,1504 MOCKINGBIRD LN,,BRIDGEPORT,TX,76426,,1.000000,0,0.00,,,2.4400,SEC 116 BLK 3 I&GN,TRACT Y-1-E,,,17080,0,0,0,0,0,0,0,33880,33880,0,0,0,0,0,0,0,0,0,16800,0,0,0,False,0,4 060,,1,False,False,A1,,,,False,False,,
2020,01,CAD,106,1-10-300130031163220000,10,01,02,03,10,12,22,32,,,,,,False,1708,KENTUCKY,W,,TX,,,100323,R,URBAN HIDDEN ACRES RV,,PO BOX 1680,,PAMPA,TX,79066,,1.000000,0,0.00,,,2.3000,SEC 116 BLK 3 I&GN,TRACT Y2A,2.30 AC,,0,6440,0,0,0,0,0,0,40460,40460,0,0,0,0,0,0,0,0,0,24210,0,9810,0,False,0,,,1,False,False,A2,,,12X40 COVERED PATIO,False,False,,